BDBM14887 3-{[3-(2-hydroxy-3-{1H-pyrrolo[3,2-c]pyridin-2-yl}phenyl)phenyl]methyl}-1-pyridin-3-ylurea::5-azaindole analog 25
SMILES Oc1c(cccc1-c1cccc(CNC(=O)Nc2cccnc2)c1)-c1cc2cnccc2[nH]1
InChI Key InChIKey=ZCNYGYSCWWIJRV-UHFFFAOYSA-N
Data  1 KI
  Tab Delimited (TSV)   2D SDfile   Computed 3D by Vconf -m prep SDfile
Find this compound or compounds like it in BindingDB:
Activity Spreadsheet -- Enzyme Inhibition Constant Data from BindingDB
Found 1 hit for monomerid = 14887
TargetCoagulation factor VII(Homo sapiens (Human))
Celera
LigandPNGBDBM14887(3-{[3-(2-hydroxy-3-{1H-pyrrolo[3,2-c]pyridin-2-yl}...)
Affinity DataKi:  155nM. Assay description: The enzyme reactions were initiated by the addition of substrate, and the color developed from the release of p-nitroanilide from each chromogenic su...
In DepthDetails ArticlePubMed