BDBM148989 US8962646, 11
SMILES CN1CC[C@]23CC(=O)CC[C@@]2(O)[C@H]1Cc1ccc(C(=O)NCCc2ccc(cc2)-c2cnc(=O)[nH]c2)c(O)c31
InChI Key
Data  2 KI
  Tab Delimited (TSV)   2D SDfile   Computed 3D by Vconf -m prep SDfile
Find this compound or compounds like it in BindingDB:
Activity Spreadsheet -- Enzyme Inhibition Constant Data from BindingDB
Found 2 hits for monomerid = 148989
TargetMu-type opioid receptor(Homo sapiens (Human))
Alkermes
US Patent
LigandPNGBDBM148989(US8962646, 11)
Affinity DataKi:  1.60nM ΔG°:  -12.0kcal/molepH: 7.5 T: 2°C. Assay description: Receptor Binding (in vitro Assay) The Ki (binding affinity) for mu-, delta-, and kippa-receptors was determined with a previously described method us...
In DepthDetails US Patent
TargetDelta-type opioid receptor(Homo sapiens (Human))
Alkermes
US Patent
LigandPNGBDBM148989(US8962646, 11)
Affinity DataKi: >1.00E+3nM ΔG°: >-8.18kcal/molepH: 7.5 T: 2°C. Assay description: Receptor Binding (in vitro Assay) The Ki (binding affinity) for mu-, delta-, and kippa-receptors was determined with a previously described method us...
In DepthDetails US Patent