BDBM149025 US8962648, 232
SMILES COc1ccc2[nH]c(=O)c3sccc3c2c1-c1ccc(cc1)[C@H](C)N
InChI Key
Data  1 IC50
  Tab Delimited (TSV)   2D SDfile   Computed 3D by Vconf -m prep SDfile
Find this compound or compounds like it in BindingDB:
Activity Spreadsheet -- Enzyme Inhibition Constant Data from BindingDB
Found 1 hit for monomerid = 149025
TargetLymphokine-activated killer T-cell-originated protein kinase(Homo sapiens (Human))
Oncotherapy Science
US Patent
LigandPNGBDBM149025(US8962648, 232)
Affinity DataIC50:  7.40nMpH: 7.4 T: 2°C. Assay description: PBK activity was determined in the presence or absence of compounds using fluorescein isothiocyanate-labeled (FITC-labeled) histone H3 peptide as a s...
In DepthDetails US Patent