BDBM149246 US8962674, CU132
SMILES COc1cc(\C=C\C(=O)CC(=O)\C=C\c2cc(O)ccc2[N+]([O-])=O)ccc1O
InChI Key InChIKey=LNSAEBZJESSXMF-YBSXJGAUSA-N
Data  1 IC50
  Tab Delimited (TSV)   2D SDfile   Computed 3D by Vconf -m prep SDfile
Find this compound or compounds like it in BindingDB:
Activity Spreadsheet -- Enzyme Inhibition Constant Data from BindingDB
Found 1 hit for monomerid = 149246
TargetBeta-secretase 1(Homo sapiens (Human))
Tokyo Institute Of Technology
US Patent
LigandPNGBDBM149246(US8962674, CU132)
Affinity DataIC50:  790nMpH: 4.5 T: 2°C. Assay description: Compounds were dissolved in dimethylsulfoxide (DMSO), and further diluted in 0.1 M sodium acetate buffer (with 150 mM sodium chloride, pH 4.5). The s...
In DepthDetails US Patent