BDBM149398 US8975247, EBP484
SMILES COc1ccc2nc(CN3CCC[C@H]3CO)n(Cc3ccc(Cl)cc3)c2c1
InChI Key InChIKey=LVPMIHVTBWZBAF-KRWDZBQOSA-N
Data  1 IC50
  Tab Delimited (TSV)   2D SDfile   Computed 3D by Vconf -m prep SDfile
Find this compound or compounds like it in BindingDB:
Activity Spreadsheet -- Enzyme Inhibition Constant Data from BindingDB
Found 1 hit for monomerid = 149398
TargetPotassium voltage-gated channel subfamily H member 2(Homo sapiens (Human))
The Board Of Trustees Of The Leland Stanford Junion University
US Patent
LigandPNGBDBM149398(US8975247, EBP484)
Affinity DataIC50:  5.00E+3nM. Assay description: Drugs belonging to different classes have been shown to be associated with QT prolongation and in some cases serious ventricular arrhythmias. The mos...
In DepthDetails US Patent