BDBM149544 US8975265, 2-42
SMILES NC1(CCC1)c1ccc(cc1)-c1nc2cc(ccn2c1-c1ccccc1)C(=O)N1CCCC1
InChI Key InChIKey=JAEYTKRVBLGLPC-UHFFFAOYSA-N
Data  2 IC50
  Tab Delimited (TSV)   2D SDfile   Computed 3D by Vconf -m prep SDfile
Find this compound or compounds like it in BindingDB:
Activity Spreadsheet -- Enzyme Inhibition Constant Data from BindingDB
Found 2 hits for monomerid = 149544
TargetRAC-beta serine/threonine-protein kinase(Homo sapiens (Human))
Bayer Intellectual Property
US Patent
LigandPNGBDBM149544(US8975265, 2-42)
Affinity DataIC50:  519nMpH: 7.5 T: 2°C. Assay description: For the assay 50 nl of a 100 fold concentrated solution of the test compound in DMSO was pipetted into a black low volume 384 well microtiter plate (...
In DepthDetails US Patent
TargetRAC-alpha serine/threonine-protein kinase(Homo sapiens (Human))
Bayer Intellectual Property
US Patent
LigandPNGBDBM149544(US8975265, 2-42)
Affinity DataIC50:  1.94E+4nMpH: 7.5 T: 2°C. Assay description: For the assay 50 nl of a 100 fold concentrated solution of the test compound in DMSO was pipetted into a black low volume 384 well microtiter plate (...
In DepthDetails US Patent