BDBM149704 US8975282, 16
SMILES Cc1c(C(=O)Nc2ccc(Oc3ccnc(NC(=O)C4CC4)c3)cc2)c(=O)n(-c2ccccc2)n1C
InChI Key InChIKey=CICHSTJOLCRZKB-UHFFFAOYSA-N
Data  2 Kd
  Tab Delimited (TSV)   2D SDfile   Computed 3D by Vconf -m prep SDfile
Find this compound or compounds like it in BindingDB:
Activity Spreadsheet -- Enzyme Inhibition Constant Data from BindingDB
Found 2 hits for monomerid = 149704
TargetHepatocyte growth factor receptor(Homo sapiens (Human))
Sunshine Lake Pharma
US Patent
LigandPNGBDBM149704(US8975282, 16)
Affinity DataKd:  0.210nMpH: 7.0 T: 2°C. Assay description: Met (h) is incubated with 8 mM MOPS pH 7.0, 0.2 mM EDTA, 250 .mu.M KKKSPGEYVNIEFG, 10 mM MgAcetate and [.gamma.-.sup.33P-ATP] (specific activity appr...
In DepthDetails US Patent
TargetVascular endothelial growth factor receptor 2(Homo sapiens (Human))
Sunshine Lake Pharma
US Patent
LigandPNGBDBM149704(US8975282, 16)
Affinity DataKd:  2.90nMpH: 7.0 T: 2°C. Assay description: KDR (h) is incubated with 8 mM MOPS pH 7.0, 0.2 mM EDTA, 0.33 mg/mL myelin basic protein, 10 mM MgAcetate and [.gamma.-.sup.33P-ATP] (specific activi...
In DepthDetails US Patent