BDBM149941 US8975415, 223::US9242973, 223
SMILES COc1cnc(cn1)C(=O)Nc1ccc2OC(C)(C)C3(CC3)[C@]3(COC(N)=N3)c2c1
InChI Key InChIKey=FVLGCKAZTKQUNT-NRFANRHFSA-N
Data  2 KI  5 IC50
  Tab Delimited (TSV)   2D SDfile   Computed 3D by Vconf -m prep SDfile
Find this compound or compounds like it in BindingDB:
Activity Spreadsheet -- Enzyme Inhibition Constant Data from BindingDB
Found 5 hits for monomerid = 149941
TargetBeta-secretase 1(Homo sapiens (Human))
Comentis
US Patent
LigandPNGBDBM149941(US8975415, 223 | US9242973, 223)
Affinity DataKi:  61.2nM IC50:  99.1nM. Assay description: Potency of test compounds were determined by measurement of their inhibition of BACE1 activity toward a fluorescent substrate. Experiments were perfo...
In DepthDetails US Patent
TargetBeta-secretase 1(Homo sapiens (Human))
Comentis
US Patent
LigandPNGBDBM149941(US8975415, 223 | US9242973, 223)
Affinity DataKi:  61.2nM ΔG°:  -9.83kcal/mole IC50:  99.1nMpH: 4.4 T: 2°C. Assay description: Test Example 1: Potency of test compounds were determined by measurement of their inhibition of BACE1 activity toward a fluorescent substrate. Experi...
In DepthDetails US Patent
TargetPotassium voltage-gated channel subfamily H member 2(Homo sapiens (Human))
Comentis
US Patent
LigandPNGBDBM149941(US8975415, 223 | US9242973, 223)
Affinity DataIC50:  2.08E+4nM. Assay description: Test Example 5: The hERG potassium current was measured in a hERG-stably-expressing Chinese hamster ovary K1 (CHO) cells. The experiments were perfor...
In DepthDetails US Patent
TargetBeta-secretase 1(Homo sapiens (Human))
Comentis
US Patent
LigandPNGBDBM149941(US8975415, 223 | US9242973, 223)
Affinity DataIC50:  3.10nMT: 2°C. Assay description: Test Example 3: The potency of compounds against BACE1 activity was determined in a cellular assay of Aβ production. Human SK-N-BE(2) neuroblas...
In DepthDetails US Patent
TargetPotassium voltage-gated channel subfamily H member 2(Homo sapiens (Human))
Comentis
US Patent
LigandPNGBDBM149941(US8975415, 223 | US9242973, 223)
Affinity DataIC50:  2.08E+4nMT: 2°C. Assay description: The hERG potassium current was measured in a hERG-stably-expressing Chinese hamster ovary K1 (CHO) cells. The experiments were performed using an aut...
In DepthDetails US Patent