BDBM150024 US8975417, 81
SMILES Cc1c2C(N(C(=O)c2nn1-c1cccnc1C)c1cc(C)c(=O)n(C)c1)c1ccc(Cl)cc1
InChI Key InChIKey=RTFLOGJKYBGANO-UHFFFAOYSA-N
Data  4 IC50
  Tab Delimited (TSV)   2D SDfile   Computed 3D by Vconf -m prep SDfile
Find this compound or compounds like it in BindingDB:
Activity Spreadsheet -- Enzyme Inhibition Constant Data from BindingDB
Found 4 hits for monomerid = 150024
TargetCREB-binding protein(Homo sapiens (Human))
Novartis
US Patent
LigandPNGBDBM150024(US8975417, 81)
Affinity DataIC50:  920nMpH: 7.5 T: 2°C. Assay description: In order to assess bromodomain selectivity, we set up a binding assay using the bromodomain encoded by the CREBBP gene. Compounds were tested in the ...
In DepthDetails US Patent
TargetBromodomain-containing protein 3(Homo sapiens (Human))
Novartis
US Patent
LigandPNGBDBM150024(US8975417, 81)
Affinity DataIC50:  97nMpH: 7.5 T: 2°C. Assay description: All assays were performed in 384-well microtiter plates. Each assay plate contained 8-point serial dilutions for 40 test compounds, plus 16 high- and...
In DepthDetails US Patent
TargetBromodomain-containing protein 2(Homo sapiens (Human))
Novartis
US Patent
LigandPNGBDBM150024(US8975417, 81)
Affinity DataIC50:  120nMpH: 7.5 T: 2°C. Assay description: All assays were performed in 384-well microtiter plates. Each assay plate contained 8-point serial dilutions for 40 test compounds, plus 16 high- and...
In DepthDetails US Patent
TargetBromodomain-containing protein 4(Homo sapiens (Human))
Novartis
US Patent
LigandPNGBDBM150024(US8975417, 81)
Affinity DataIC50:  110nMpH: 7.5 T: 2°C. Assay description: All assays were performed in 384-well microtiter plates. Each assay plate contained 8-point serial dilutions for 40 test compounds, plus 16 high- and...
In DepthDetails US Patent