BDBM15018 4-[2-(phenylamino)pyridin-3-yl]-N-(3,4,5-trimethoxyphenyl)-1,3,5-triazin-2-amine::triazine 34
SMILES COc1cc(Nc2ncnc(n2)-c2cccnc2Nc2ccccc2)cc(OC)c1OC
InChI Key InChIKey=YRSYWYSGZPRSOP-UHFFFAOYSA-N
Data  2 IC50
PDB links: 1 PDB ID matches this monomer.
  Tab Delimited (TSV)   2D SDfile   Computed 3D by Vconf -m prep SDfile
Find this compound or compounds like it in BindingDB:
Activity Spreadsheet -- Enzyme Inhibition Constant Data from BindingDB
Found 2 hits for monomerid = 15018
TargetVascular endothelial growth factor receptor 2(Homo sapiens (Human))
Amgen
LigandPNGBDBM15018(4-[2-(phenylamino)pyridin-3-yl]-N-(3,4,5-trimethox...)
Affinity DataIC50:  68nM. Assay description: The assay uses purified enzyme interacting with biotinylated peptide substrate. HTRF is based on the proximity of europium cryptate (donor fluorophor...
TargetAngiopoietin-1 receptor(Homo sapiens (Human))
Amgen
LigandPNGBDBM15018(4-[2-(phenylamino)pyridin-3-yl]-N-(3,4,5-trimethox...)
Affinity DataIC50: >5.00E+3nM. Assay description: The assay uses purified enzyme interacting with biotinylated peptide substrate. HTRF is based on the proximity of europium cryptate (donor fluorophor...
In DepthDetails ArticlePubMed