BDBM150230 US8980916, 2
SMILES Nc1noc2cc(NC(=O)C(O)c3cccn(-c4ccc(OC(F)(F)F)cc4)c3=O)ccc12
InChI Key InChIKey=LMDYTZLOSRFUFL-UHFFFAOYSA-N
Data  1 IC50
  Tab Delimited (TSV)   2D SDfile   Computed 3D by Vconf -m prep SDfile
Find this compound or compounds like it in BindingDB:
Activity Spreadsheet -- Enzyme Inhibition Constant Data from BindingDB
Found 1 hit for monomerid = 150230
TargetCoagulation factor IX(Homo sapiens (Human))
Merck Sharp & Dohme
US Patent
LigandPNGBDBM150230(US8980916, 2)
Affinity DataIC50:  8.60E+3nMpH: 8.0 T: 2°C. Assay description: Inhibitory activity against Factor IXa was tested using the substrate SPECTROFLUOR FIXa (American Diagnostica Inc.; 500 West Avenue, Stamford, Conn. ...
In DepthDetails US Patent