BDBM15033 5-[(2S)-2-amino-3-(1H-indol-3-yl)propoxy]-N-(pyridin-3-yl)pyridin-3-amine::pyridine-base inhibitor 7b
SMILES N[C@H](COc1cncc(Nc2cccnc2)c1)Cc1c[nH]c2ccccc12
InChI Key InChIKey=JJGWIBAOEPVJHA-INIZCTEOSA-N
Data  2 IC50
  Tab Delimited (TSV)   2D SDfile   Computed 3D by Vconf -m prep SDfile
Find this compound or compounds like it in BindingDB:
Activity Spreadsheet -- Enzyme Inhibition Constant Data from BindingDB
Found 2 hits for monomerid = 15033
TargetRAC-alpha serine/threonine-protein kinase(Homo sapiens (Human))
Zhejiang University
Curated by ChEMBL
LigandPNGBDBM15033(5-[(2S)-2-amino-3-(1H-indol-3-yl)propoxy]-N-(pyrid...)
Affinity DataIC50:  2.16E+3nM. Assay description: Inhibition of Akt
In DepthDetails ArticlePubMed
LigandPNGBDBM15033(5-[(2S)-2-amino-3-(1H-indol-3-yl)propoxy]-N-(pyrid...)
Affinity DataIC50:  2.16E+3nMpH: 7.5 T: 2°C. Assay description: The kinase assay uses His-Akt1 and a biotinylated peptide as substrate. The biotinylated peptides were immobilized on streptavidin-coated FLASH plat...
In DepthDetails ArticlePubMed