BDBM150424 US10238633, Example 98::US8987249, 98::US9713606, 98
SMILES Fc1cc(ccc1CC(NC(=O)[C@H]1N[C@@H]2CC[C@H]1C2)C#N)-c1ncc(Cl)cn1
InChI Key InChIKey=AKPGVXYITPFJOW-UDOSGHBDSA-N
Data  5 IC50
  Tab Delimited (TSV)   2D SDfile   Computed 3D by Vconf -m prep SDfile
Find this compound or compounds like it in BindingDB:
Activity Spreadsheet -- Enzyme Inhibition Constant Data from BindingDB
Found 5 hits for monomerid = 150424
TargetDipeptidyl peptidase 1(Homo sapiens (Human))
Boehringer Ingelheim International
US Patent
LigandPNGBDBM150424(US10238633, Example 98 | US8987249, 98 | US9713606...)
Affinity DataIC50:  20.3nMT: 2°C. Assay description: The recombinant human DPPI was diluted in TAGZyme buffer to 1 U/ml (38.1 ug/ml, respectively), and then activated by mixing in a 1:2 ratio with a Cys...
Ligand InfoPC cidPC sid
In DepthDetails US Patent
TargetCathepsin K(Homo sapiens (Human))
Boehringer Ingelheim International
US Patent
LigandPNGBDBM150424(US10238633, Example 98 | US8987249, 98 | US9713606...)
Affinity DataIC50:  8.40E+3nMpH: 3.5 T: 2°C. Assay description: Materials: Microtiterplates (Optiplate-384 F were purchased from PerkinElmer (Prod. No. 6007270). The substrate Z-Gly-Pro-Arg-AMC was from Biomol (Pr...
Ligand InfoPC cidPC sid
In DepthDetails US Patent
TargetCathepsin K(Homo sapiens (Human))
Boehringer Ingelheim International
US Patent
LigandPNGBDBM150424(US10238633, Example 98 | US8987249, 98 | US9713606...)
Affinity DataIC50:  8.40E+3nM. Assay description: To activate the proenzyme, 5 μl procathepsin K were mixed with 1 ul activation buffer, and incubated at room temperature for 30 min.5 μL te...
Ligand InfoPC cidPC sid
In DepthDetails US Patent
TargetDipeptidyl peptidase 1(Homo sapiens (Human))
Boehringer Ingelheim International
US Patent
LigandPNGBDBM150424(US10238633, Example 98 | US8987249, 98 | US9713606...)
Affinity DataIC50:  20.3nM. Assay description: The recombinant human DPPI was diluted in TAGZyme buffer to 1 U/ml (38.1 μg/ml, respectively), and then activated by mixing in a 1:2 ratio with ...
Ligand InfoPC cidPC sid
In DepthDetails US Patent
TargetDipeptidyl peptidase 1(Homo sapiens (Human))
Boehringer Ingelheim International
US Patent
LigandPNGBDBM150424(US10238633, Example 98 | US8987249, 98 | US9713606...)
Affinity DataIC50:  20.3nMpH: 6.0 T: 2°C. Assay description: Materials: Microtiterplates (Optiplate-384 F) were purchased from PerkinElmer (Prod. No. 6007270). The substrate Gly-Arg-AMC was from Biotrend (Prod....
Ligand InfoPC cidPC sid
In DepthDetails US Patent