BDBM150692 US8987254, 7
SMILES NC1=N[C@]2(CN(C[C@H]2CS1)c1ncc(F)cn1)c1cc(NC(=O)c2ccc(cn2)[N+]#[C-])ccc1F
InChI Key InChIKey=QSJPABCOZGEIEO-NPMABZOXSA-N
Data  1 IC50
  Tab Delimited (TSV)   2D SDfile   Computed 3D by Vconf -m prep SDfile
Find this compound or compounds like it in BindingDB:
Activity Spreadsheet -- Enzyme Inhibition Constant Data from BindingDB
Found 1 hit for monomerid = 150692
TargetBeta-secretase 1(Homo sapiens (Human))
Eli Lilly
US Patent
LigandPNGBDBM150692(US8987254, 7)
Affinity DataIC50:  0.358nMpH: 4.6 T: 2°C. Assay description: Serial dilutions of test compounds are prepared as described above. Compounds are further diluted 20x in KH2PO4 buffer. Ten uL of each dilution is ad...
In DepthDetails US Patent