BDBM150762 2-(4-Bromophenyl)-4H-chromen-4-one (3n)
SMILES Brc1ccc(cc1)-c1cc(=O)c2ccccc2o1
InChI Key InChIKey=URZUAHXELZUWFE-UHFFFAOYSA-N
Data  2 KI
PDB links: 1 PDB ID matches this monomer.
  Tab Delimited (TSV)   2D SDfile   Computed 3D by Vconf -m prep SDfile
Find this compound or compounds like it in BindingDB:
Activity Spreadsheet -- Enzyme Inhibition Constant Data from BindingDB
Found 2 hits for monomerid = 150762
TargetAmine oxidase [flavin-containing] B(Homo sapiens (Human))
Birla Institute Of Technology
LigandPNGBDBM150762(2-(4-Bromophenyl)-4H-chromen-4-one (3n))
Affinity DataKi:  520nM. Assay description: The activities of recombinant hMAO-A and hMAO-B were determined using p-tyramine as common substrate and calculated as 0.18 +/- 0.01 nmol/mg/min (n =...
In DepthDetails ArticlePubMed
TargetAmine oxidase [flavin-containing] A(Homo sapiens (Human))
Birla Institute Of Technology
LigandPNGBDBM150762(2-(4-Bromophenyl)-4H-chromen-4-one (3n))
Affinity DataKi:  2.00E+3nM. Assay description: The activities of recombinant hMAO-A and hMAO-B were determined using p-tyramine as common substrate and calculated as 0.18 +/- 0.01 nmol/mg/min (n =...
In DepthDetails ArticlePubMed