BDBM150769 2-(5H-[1,2,4]triazino[5,6-b]indol-3-ylthio)-1-(biphenyl-4-yl)-ethanone (2)
SMILES O=C(CSc1nnc2c(n1)[nH]c1ccccc21)c1ccc(cc1)-c1ccccc1
InChI Key InChIKey=GDBZIUKVGZBIRK-UHFFFAOYSA-N
Data  1 IC50
  Tab Delimited (TSV)   2D SDfile   Computed 3D by Vconf -m prep SDfile
Find this compound or compounds like it in BindingDB:
Activity Spreadsheet -- Enzyme Inhibition Constant Data from BindingDB
Found 1 hit for monomerid = 150769
TargetOligo-1,6-glucosidase IMA1(Saccharomyces cerevisiae S288c (Baker's yeast))
Hazara University
LigandPNGBDBM150769(2-(5H-[1,2,4]triazino[5,6-b]indol-3-ylthio)-1-(bip...)
Affinity DataIC50:  7.84E+4nMT: 2°C. Assay description: Typically, α-glucosidase activity was assayed in 50 mM phosphate buffer (pH 6.8) containing 5% v/v DMSO and PNP glycoside was used as a substrat...
In DepthDetails ArticlePubMed