BDBM15115 4-[(E)-2-{5-[(2S)-2-amino-3-(1H-indol-3-yl)propoxy]pyridin-3-yl}ethenyl]pyridin-2-amine::trans-bispyridinylethylene analog 10e
SMILES N[C@H](COc1cncc(\C=C\c2ccnc(N)c2)c1)Cc1c[nH]c2ccccc12
InChI Key InChIKey=NGPBCOMMIVWVIT-UEKDZROGSA-N
Data  2 IC50
  Tab Delimited (TSV)   2D SDfile   Computed 3D by Vconf -m prep SDfile
Find this compound or compounds like it in BindingDB:
Activity Spreadsheet -- Enzyme Inhibition Constant Data from BindingDB
Found 2 hits for monomerid = 15115
TargetRAC-alpha serine/threonine-protein kinase(Homo sapiens (Human))
Zhejiang University
Curated by ChEMBL
LigandPNGBDBM15115(4-[(E)-2-{5-[(2S)-2-amino-3-(1H-indol-3-yl)propoxy...)
Affinity DataIC50:  121nM. Assay description: Inhibition of Akt
In DepthDetails ArticlePubMed
LigandPNGBDBM15115(4-[(E)-2-{5-[(2S)-2-amino-3-(1H-indol-3-yl)propoxy...)
Affinity DataIC50:  121nM. Assay description: The kinase assay uses His-Akt1 and a biotinylated peptide as substrate. The biotinylated peptides were immobilized on streptavidin-coated FLASH plat...
In DepthDetails ArticlePubMed