BDBM151214 US8987314, B5
SMILES NS(=O)(=O)CCNC(=O)C(c1nc2ccc(cc2s1)-c1ccc(F)nc1)S(=O)(=O)Cc1ccccc1
InChI Key InChIKey=ZKPLEXJKWFVTRI-UHFFFAOYSA-N
Data  1 IC50
  Tab Delimited (TSV)   2D SDfile   Computed 3D by Vconf -m prep SDfile
Find this compound or compounds like it in BindingDB:
Activity Spreadsheet -- Enzyme Inhibition Constant Data from BindingDB
Found 1 hit for monomerid = 151214
TargetEndothelial lipase(Homo sapiens (Human))
Bristol-Myers Squibb
US Patent
LigandPNGBDBM151214(US8987314, B5)
Affinity DataIC50: <10nMpH: 8.0 T: 2°C. Assay description: Endothelial lipase (EL) and hepatic lipase (HL) activities were measured using a fluorescent substrate, A10070, (Invitrogen, CA) doped into an artifi...
In DepthDetails US Patent