BDBM151245 US8987314, B41
SMILES CS(=O)(=O)C(C(=O)NCCS(N)(=O)=O)c1nc2ccc(cc2s1)-c1ccc(cc1)C(=O)NCC(F)(F)F
InChI Key InChIKey=KWRUUINPESGGPP-UHFFFAOYSA-N
Data  2 IC50
  Tab Delimited (TSV)   2D SDfile   Computed 3D by Vconf -m prep SDfile
Find this compound or compounds like it in BindingDB:
Activity Spreadsheet -- Enzyme Inhibition Constant Data from BindingDB
Found 2 hits for monomerid = 151245
TargetHepatic triacylglycerol lipase(Homo sapiens (Human))
Bristol-Myers Squibb
US Patent
LigandPNGBDBM151245(US8987314, B41)
Affinity DataIC50:  17nMpH: 8.0 T: 2°C. Assay description: Endothelial lipase (EL) and hepatic lipase (HL) activities were measured using a fluorescent substrate, A10070, (Invitrogen, CA) doped into an artifi...
In DepthDetails US Patent
TargetEndothelial lipase(Homo sapiens (Human))
Bristol-Myers Squibb
US Patent
LigandPNGBDBM151245(US8987314, B41)
Affinity DataIC50: <10nMpH: 8.0 T: 2°C. Assay description: Endothelial lipase (EL) and hepatic lipase (HL) activities were measured using a fluorescent substrate, A10070, (Invitrogen, CA) doped into an artifi...
In DepthDetails US Patent