BDBM15153 1-(1-{[4-(5-methyl-6-oxo-3-phenyl-1,6-dihydropyrazin-2-yl)phenyl]methyl}piperidin-4-yl)-2,3-dihydro-1H-1,3-benzodiazol-2-one::pyrazinone 14b
SMILES Cc1nc(-c2ccccc2)c([nH]c1=O)-c1ccc(CN2CCC(CC2)n2c3ccccc3[nH]c2=O)cc1
InChI Key InChIKey=JQURUANNPOVYFL-UHFFFAOYSA-N
Data  4 IC50
  Tab Delimited (TSV)   2D SDfile   Computed 3D by Vconf -m prep SDfile
Find this compound or compounds like it in BindingDB:
Activity Spreadsheet -- Enzyme Inhibition Constant Data from BindingDB
Found 4 hits for monomerid = 15153
TargetRAC-alpha serine/threonine-protein kinase(Homo sapiens (Human))
Merck Research Laboratories
LigandPNGBDBM15153(1-(1-{[4-(5-methyl-6-oxo-3-phenyl-1,6-dihydropyraz...)
Affinity DataIC50:  1.00E+3nMpH: 7.5 T: 2°C. Assay description: Purified recombinant human Akt1, Akt2, and Akt3 proteins were monitored for kinase activity in the presence or absence of Akt inhibitors in a 96-well...
In DepthDetails ArticlePubMed
TargetRAC-alpha serine/threonine-protein kinase(Homo sapiens (Human))
Merck Research Laboratories
LigandPNGBDBM15153(1-(1-{[4-(5-methyl-6-oxo-3-phenyl-1,6-dihydropyraz...)
Affinity DataIC50:  1.00E+3nM. Assay description: Inhibition of Akt
In DepthDetails ArticlePubMed
TargetRAC-gamma serine/threonine-protein kinase(Homo sapiens (Human))
Merck Research Laboratories
LigandPNGBDBM15153(1-(1-{[4-(5-methyl-6-oxo-3-phenyl-1,6-dihydropyraz...)
Affinity DataIC50:  3.31E+4nM. Assay description: Purified recombinant human Akt1, Akt2, and Akt3 proteins were monitored for kinase activity in the presence or absence of Akt inhibitors in a 96-well...
In DepthDetails ArticlePubMed
TargetRAC-beta serine/threonine-protein kinase(Homo sapiens (Human))
Merck Research Laboratories
LigandPNGBDBM15153(1-(1-{[4-(5-methyl-6-oxo-3-phenyl-1,6-dihydropyraz...)
Affinity DataIC50:  1.18E+3nM. Assay description: Purified recombinant human Akt1, Akt2, and Akt3 proteins were monitored for kinase activity in the presence or absence of Akt inhibitors in a 96-well...
In DepthDetails ArticlePubMed