BDBM151580 US8987314, B394
SMILES CS(=O)(=O)C(C(=O)NCCS(N)(=O)=O)c1nc2cc(ccc2s1)C(=O)NCCc1ccc(F)cc1
InChI Key InChIKey=QCFSUMKENQKRFX-UHFFFAOYSA-N
Data  2 IC50
  Tab Delimited (TSV)   2D SDfile   Computed 3D by Vconf -m prep SDfile
Find this compound or compounds like it in BindingDB:
Activity Spreadsheet -- Enzyme Inhibition Constant Data from BindingDB
Found 2 hits for monomerid = 151580
TargetHepatic triacylglycerol lipase(Homo sapiens (Human))
Bristol-Myers Squibb
US Patent
LigandPNGBDBM151580(US8987314, B394)
Affinity DataIC50:  1.60E+3nMpH: 8.0 T: 2°C. Assay description: Endothelial lipase (EL) and hepatic lipase (HL) activities were measured using a fluorescent substrate, A10070, (Invitrogen, CA) doped into an artifi...
In DepthDetails US Patent
TargetEndothelial lipase(Homo sapiens (Human))
Bristol-Myers Squibb
US Patent
LigandPNGBDBM151580(US8987314, B394)
Affinity DataIC50:  37.4nMpH: 8.0 T: 2°C. Assay description: Endothelial lipase (EL) and hepatic lipase (HL) activities were measured using a fluorescent substrate, A10070, (Invitrogen, CA) doped into an artifi...
In DepthDetails US Patent