BDBM151766 US8987445, 202
SMILES Cc1cc2ccccc2nc1N(Cc1ccc(c(Cl)c1)C(F)(F)C1CC1)S(=O)(=O)c1ccc(cc1)C(O)=O
InChI Key InChIKey=VEFQBFRJLHFXPA-UHFFFAOYSA-N
Data  1 IC50
  Tab Delimited (TSV)   2D SDfile   Computed 3D by Vconf -m prep SDfile
Find this compound or compounds like it in BindingDB:
Activity Spreadsheet -- Enzyme Inhibition Constant Data from BindingDB
Found 1 hit for monomerid = 151766
TargetTransient receptor potential cation channel subfamily M member 8(Homo sapiens (Human))
Mitsubishi Tanabe Pharma
US Patent
LigandPNGBDBM151766(US8987445, 202)
Affinity DataIC50:  1.40nMT: 2°C. Assay description: The functional activity of compounds was determined by measuring changes in intracellular calcium concentration using a Ca2+ sensitive fluorescent dy...
In DepthDetails US Patent