BDBM152014 US8987473, 75
SMILES Cc1cccc(C)c1CN1CCc2ccc(CC(O)=O)cc12
InChI Key InChIKey=LWMWFNZVGKSTIH-UHFFFAOYSA-N
Data  1 IC50
  Tab Delimited (TSV)   2D SDfile   Computed 3D by Vconf -m prep SDfile
Find this compound or compounds like it in BindingDB:
Activity Spreadsheet -- Enzyme Inhibition Constant Data from BindingDB
Found 1 hit for monomerid = 152014
TargetSolute carrier family 22 member 12(Homo sapiens (Human))
Sato Pharmaceutical
US Patent
LigandPNGBDBM152014(US8987473, 75)
Affinity DataIC50:  77nM. Assay description: It was introduced human URAT1 full-length cDNA into an expression vector pcDNA5 / FRT / V5-His TOPO (registered trademark) (Invitrogen). The result...
In DepthDetails US Patent