BDBM152037 US8987473, 117
SMILES Cc1nn(Cc2c(C)cccc2C)c2cc(ccc12)C(O)=O
InChI Key InChIKey=PFQADMQBKHLZBV-UHFFFAOYSA-N
Data  1 IC50
  Tab Delimited (TSV)   2D SDfile   Computed 3D by Vconf -m prep SDfile
Find this compound or compounds like it in BindingDB:
Activity Spreadsheet -- Enzyme Inhibition Constant Data from BindingDB
Found 1 hit for monomerid = 152037
TargetSolute carrier family 22 member 12(Homo sapiens (Human))
Sato Pharmaceutical
US Patent
LigandPNGBDBM152037(US8987473, 117)
Affinity DataIC50:  91nM. Assay description: It was introduced human URAT1 full-length cDNA into an expression vector pcDNA5 / FRT / V5-His TOPO (registered trademark) (Invitrogen). The result...
In DepthDetails US Patent