BDBM152187 US8987474, RPM305
SMILES CC(C)NS(=O)(=O)c1ccc2NC(=O)\C(=C/Nc3ccc(cc3)C(O)=O)c2c1
InChI Key InChIKey=GBCVBYCPSGKIMO-YBEGLDIGSA-N
Data  1 IC50
  Tab Delimited (TSV)   2D SDfile   Computed 3D by Vconf -m prep SDfile
Find this compound or compounds like it in BindingDB:
Activity Spreadsheet -- Enzyme Inhibition Constant Data from BindingDB
Found 1 hit for monomerid = 152187
TargetTyrosine-protein phosphatase non-receptor type 11(Homo sapiens (Human))
University Of South Florida
US Patent
LigandPNGBDBM152187(US8987474, RPM305)
Affinity DataIC50:  6.65E+4nM. Assay description: NSC-87877 ranked among top 10% (175th) of the compounds with the best GLIDE scores for the docking to the human Shp2 PTP domain in our virtual screen...
In DepthDetails US Patent