BDBM152354 US8993565, 75
SMILES FC(F)C(F)(F)Oc1cccc(NC(=O)Cc2nc(cc(=O)[nH]2)N2CCOCC2)c1
InChI Key InChIKey=VKNAORZFYXEFPO-UHFFFAOYSA-N
Data  1 IC50
  Tab Delimited (TSV)   2D SDfile   Computed 3D by Vconf -m prep SDfile
Find this compound or compounds like it in BindingDB:
Activity Spreadsheet -- Enzyme Inhibition Constant Data from BindingDB
Found 1 hit for monomerid = 152354
TargetRAC-alpha serine/threonine-protein kinase(Homo sapiens (Human))
Sanofi
US Patent
LigandPNGBDBM152354(US8993565, 75)
Affinity DataIC50:  69nM. Assay description: This test is based on measuring the expression of the AKT protein phosphorylated on serine 473 (P-AKT-S473), in the PC3 human prostate carcinoma line...
In DepthDetails US Patent