BDBM152366 US8993565, 94
SMILES Fc1ccc2N(CCc2c1F)C(=O)Cc1nc(cc(=O)[nH]1)N1CCOCC1
InChI Key InChIKey=RMZIUTVPVNZDIM-UHFFFAOYSA-N
Data  1 IC50
  Tab Delimited (TSV)   2D SDfile   Computed 3D by Vconf -m prep SDfile
Find this compound or compounds like it in BindingDB:
Activity Spreadsheet -- Enzyme Inhibition Constant Data from BindingDB
Found 1 hit for monomerid = 152366
TargetRAC-alpha serine/threonine-protein kinase(Homo sapiens (Human))
Sanofi
US Patent
LigandPNGBDBM152366(US8993565, 94)
Affinity DataIC50:  11nM. Assay description: This test is based on measuring the expression of the AKT protein phosphorylated on serine 473 (P-AKT-S473), in the PC3 human prostate carcinoma line...
In DepthDetails US Patent