BDBM152372 US8993565, 104
SMILES Cn1c(CC(=O)N2CCc3c2cccc3Cl)nc(cc1=O)N1CCOCC1
InChI Key InChIKey=IXIOWSLIYXIJDD-UHFFFAOYSA-N
Data  1 IC50
  Tab Delimited (TSV)   2D SDfile   Computed 3D by Vconf -m prep SDfile
Find this compound or compounds like it in BindingDB:
Activity Spreadsheet -- Enzyme Inhibition Constant Data from BindingDB
Found 1 hit for monomerid = 152372
TargetRAC-alpha serine/threonine-protein kinase(Homo sapiens (Human))
Sanofi
US Patent
LigandPNGBDBM152372(US8993565, 104)
Affinity DataIC50:  42nM. Assay description: This test is based on measuring the expression of the AKT protein phosphorylated on serine 473 (P-AKT-S473), in the PC3 human prostate carcinoma line...
In DepthDetails US Patent