BDBM152518 N-(4-(2-(4-(furan-2-carbonyl)piperazin-1-yl)-2-oxoethoxy)phenyl)acetamide (1g)
SMILES CC(=O)Nc1ccc(OCC(=O)N2CCN(CC2)C(=O)c2ccco2)cc1
InChI Key InChIKey=CESIPMQEODLITQ-UHFFFAOYSA-N
Data  1 KI  1 IC50
  Tab Delimited (TSV)   2D SDfile   Computed 3D by Vconf -m prep SDfile
Find this compound or compounds like it in BindingDB:
Activity Spreadsheet -- Enzyme Inhibition Constant Data from BindingDB
Found 1 hit for monomerid = 152518
TargetAcetylcholinesterase(Mus musculus (mouse))
Panjab University
LigandPNGBDBM152518(N-(4-(2-(4-(furan-2-carbonyl)piperazin-1-yl)-2-oxo...)
Affinity DataKi:  1.95E+4nM IC50:  1.07E+4nMpH: 8.0Assay Description:An aliquot of diluted solution at five different concentration (1, 5, 10,15 and 25 µl) levels was mixed with phosphate buffer (pH 8.0, 3.0 ml), 100 µ...
In DepthDetails ArticlePubMed