BDBM152532 Benzo[g]pteridine-2,4(3H,10H)-dione (7)
SMILES O=c1nc2[nH]c3ccccc3nc2c(=O)[nH]1
InChI Key InChIKey=HAUGRYOERYOXHX-UHFFFAOYSA-N
Data  2 IC50
  Tab Delimited (TSV)   2D SDfile   Computed 3D by Vconf -m prep SDfile
Find this compound or compounds like it in BindingDB:
Activity Spreadsheet -- Enzyme Inhibition Constant Data from BindingDB
Found 2 hits for monomerid = 152532
TargetCarboxylic ester hydrolase(Equus caballus (Horse))
The M. S. University Of Baroda
LigandPNGBDBM152532(Benzo[g]pteridine-2,4(3H,10H)-dione (7))
Affinity DataIC50:  5.56E+4nMpH: 8.0 T: 2°C. Assay description: Suitable agents like donepezil hydrochloride and tacrine hydrochloride hydrate were used as standards for this study. Buffer solution (50 mM Tris-HCl...
In DepthDetails ArticlePubMed
TargetAcetylcholinesterase(Homo sapiens (Human))
The M. S. University Of Baroda
LigandPNGBDBM152532(Benzo[g]pteridine-2,4(3H,10H)-dione (7))
Affinity DataIC50:  6.45E+4nMpH: 8.0 T: 2°C. Assay description: Suitable agents like donepezil hydrochloride and tacrine hydrochloride hydrate were used as standards for this study. Buffer solution (50 mM Tris-HCl...
In DepthDetails ArticlePubMed