BDBM1526 2-ethyl-5-fluoro-7-methyl-2,4,9,15-tetraazatricyclo[9.4.0.0^{3,8}]pentadeca-1(11),3,5,7,12,14-hexaen-10-one::Dipyridodiazepinone deriv. 13
SMILES CCN1c2nc(F)cc(C)c2NC(=O)c2cccnc12
InChI Key InChIKey=UPRAQJJHHIYMOB-UHFFFAOYSA-N
Data  2 IC50
  Tab Delimited (TSV)   2D SDfile   Computed 3D by Vconf -m prep SDfile
Find this compound or compounds like it in BindingDB:
Activity Spreadsheet -- Enzyme Inhibition Constant Data from BindingDB
Found 2 hits for monomerid = 1526
TargetGag-Pol polyprotein [600-1027,Y780C]/[600-1155,Y780C](Human immunodeficiency virus type 1)
Boehringer Ingelheim Pharmaceuticals
LigandPNGBDBM1526(2-ethyl-5-fluoro-7-methyl-2,4,9,15-tetraazatricycl...)
Affinity DataIC50:  850nMpH: 7.8 T: 2°C. Assay description: The IC50 of reverse transcriptase is the concentration that inhibits 50% of recombinant HIV-1 RT RNA-directed DNA polymerase activity in vitro.
In DepthDetails ArticlePubMed
TargetGag-Pol polyprotein [600-1027,R876K]/[600-1155](Human immunodeficiency virus type 1)
Boehringer Ingelheim Pharmaceuticals
LigandPNGBDBM1526(2-ethyl-5-fluoro-7-methyl-2,4,9,15-tetraazatricycl...)
Affinity DataIC50:  20nMpH: 7.8 T: 2°C. Assay description: The IC50 of reverse transcriptase is the concentration that inhibits 50% of recombinant HIV-1 RT RNA-directed DNA polymerase activity in vitro.
In DepthDetails ArticlePubMed