BDBM152752 3-((5-bromo-6-methyl-2-(4-methylpiperazin-1-yl)pyrimidin-4-yl)thio)-6-methyl-8-(4-methylpiperazin-1-yl)-5H-pyrimido[5,4-e][1,2,4]triazolo[3,4-b][1,3,4]thiadiazine (5d)
SMILES CN1CCN(CC1)c1nc(C)c(C)c(Sc2nnc3Sc4nc(nc(C)c4Nn23)N2CCN(C)CC2)n1
InChI Key InChIKey=ROVYSXLUSSLOEJ-UHFFFAOYSA-N
Data  1 IC50
  Tab Delimited (TSV)   2D SDfile   Computed 3D by Vconf -m prep SDfile
Find this compound or compounds like it in BindingDB:
Activity Spreadsheet -- Enzyme Inhibition Constant Data from BindingDB
Found 1 hit for monomerid = 152752
TargetSeed linoleate 13S-lipoxygenase-1(Glycine max (soybean))
Ferdowsi University Of Mashhad
LigandPNGBDBM152752(3-((5-bromo-6-methyl-2-(4-methylpiperazin-1-yl)pyr...)
Affinity DataIC50: >5.00E+5nMpH: 7.0 T: 2°C. Assay description: Linoleic acid and two assay solutions (A and B) were prepared in advance. Solution A was 50 mM 3-(dimethylamino)benzoic acid (DMAB) in a 100 mM phosp...
In DepthDetails ArticlePubMed