BDBM15283 N-{7-chloro-19-cyano-3-oxo-11,17-dioxa-2,4,20,22-tetraazatricyclo[16.3.1.0^{5,10}]docosa-1(21),5(10),6,8,18(22),19-hexaen-8-yl}-2-(dimethylamino)acetamide::macrocyclic inhibitor 18b
SMILES CN(C)CC(=O)Nc1cc2OCCCCCOc3nc(NC(=O)Nc2cc1Cl)cnc3C#N
InChI Key InChIKey=LQSRLSAEUXMZII-UHFFFAOYSA-N
Data  1 IC50
  Tab Delimited (TSV)   2D SDfile   Computed 3D by Vconf -m prep SDfile
Find this compound or compounds like it in BindingDB:
Activity Spreadsheet -- Enzyme Inhibition Constant Data from BindingDB
Found 1 hit for monomerid = 15283
TargetSerine/threonine-protein kinase Chk1(Homo sapiens (Human))
Abbott Laboratories
LigandPNGBDBM15283(N-{7-chloro-19-cyano-3-oxo-11,17-dioxa-2,4,20,22-t...)
Affinity DataIC50:  1nM. Assay description: Chk1 kinase activity was assayed in reaction buffer containing substrate, enzyme, and inhibitor in the presence of 5uM ATP/[gamma-33P] ATP. 33P incor...
In DepthDetails ArticlePubMed