BDBM153057 US8993616, 203
SMILES OC(=O)c1ccc(cc1O)-n1cc(C#N)c2c(O)cccc12
InChI Key InChIKey=KMJBUCRCHVNFMX-UHFFFAOYSA-N
Data  1 IC50
  Tab Delimited (TSV)   2D SDfile   Computed 3D by Vconf -m prep SDfile
Find this compound or compounds like it in BindingDB:
Activity Spreadsheet -- Enzyme Inhibition Constant Data from BindingDB
Found 1 hit for monomerid = 153057
TargetXanthine dehydrogenase/oxidase(Bos taurus (Bovine))
Kissei Pharmaceutical
US Patent
LigandPNGBDBM153057(US8993616, 203)
Affinity DataIC50:  7.10nMT: 2°C. Assay description: Test compounds were dissolved in DMSO (Wako) at 40 mM concentration and then diluted to intended concentrations with phosphate-buffered saline (PBS)....
In DepthDetails US Patent