BDBM153072 US8993616, 219
SMILES CCOCCOc1ccc2c(cn(-c3ccc(C(O)=O)c(O)c3)c2c1)C#N
InChI Key InChIKey=XJNMBQYPXDEANE-UHFFFAOYSA-N
Data  1 IC50
  Tab Delimited (TSV)   2D SDfile   Computed 3D by Vconf -m prep SDfile
Find this compound or compounds like it in BindingDB:
Activity Spreadsheet -- Enzyme Inhibition Constant Data from BindingDB
Found 1 hit for monomerid = 153072
TargetXanthine dehydrogenase/oxidase(Bos taurus (Bovine))
Kissei Pharmaceutical
US Patent
LigandPNGBDBM153072(US8993616, 219)
Affinity DataIC50:  8.30nMT: 2°C. Assay description: Test compounds were dissolved in DMSO (Wako) at 40 mM concentration and then diluted to intended concentrations with phosphate-buffered saline (PBS)....
In DepthDetails US Patent