BDBM153281 1-Benzofuran-2-yl-3-(4,7-dimethoxy-naphthalen-1-yl)-propenone (2)
SMILES COc1ccc2c(OC)ccc(\C=C\C(=O)c3cc4ccccc4o3)c2c1
InChI Key InChIKey=ZZNLOWNLKLCDFQ-YRNVUSSQSA-N
Data  3 IC50
  Tab Delimited (TSV)   2D SDfile   Computed 3D by Vconf -m prep SDfile
Find this compound or compounds like it in BindingDB:
Activity Spreadsheet -- Enzyme Inhibition Constant Data from BindingDB
Found 3 hits for monomerid = 153281
TargetPhospholipase A2 group V(Homo sapiens (Human))
Universiti Kebangsaan Malaysia, Jalan Raja Muda Abdul Aziz
LigandPNGBDBM153281(1-Benzofuran-2-yl-3-(4,7-dimethoxy-naphthalen-1-yl...)
Affinity DataIC50:  2.78E+4nMpH: 7.5 T: 2°C. Assay description: Briefly, sn-2ester bond of the substrate 1,2-bis(heptanoylthio)-glycerophosphocholine was hydrolyzed by PLA2-V followed by the exposure of free thiol...
In DepthDetails ArticlePubMed
TargetProstaglandin G/H synthase 2(Homo sapiens (Human))
Universiti Kebangsaan Malaysia, Jalan Raja Muda Abdul Aziz
LigandPNGBDBM153281(1-Benzofuran-2-yl-3-(4,7-dimethoxy-naphthalen-1-yl...)
Affinity DataIC50:  1.91E+4nMpH: 8.0 T: 2°C. Assay description: 100 mM Tris¿HCl buffer, pH 8.0 containing 1 µM heme and COX-1 (ovine) or COX-2(human recombinant), which was preincubated for 10 min in a water bath ...
In DepthDetails ArticlePubMed
TargetProstaglandin G/H synthase 1(Ovis aries (Sheep))
Universiti Kebangsaan Malaysia, Jalan Raja Muda Abdul Aziz
LigandPNGBDBM153281(1-Benzofuran-2-yl-3-(4,7-dimethoxy-naphthalen-1-yl...)
Affinity DataIC50:  1.50E+4nMpH: 8.0 T: 2°C. Assay description: 100 mM Tris¿HCl buffer, pH 8.0 containing 1 µM heme and COX-1 (ovine) or COX-2(human recombinant), which was preincubated for 10 min in a water bath ...
In DepthDetails ArticlePubMed