BDBM153650 US8999982, 4-((6,7-dimethoxyquinolin-4- yl)oxy)-2-methoxyaniline
SMILES COc1cc(Oc2ccnc3cc(OC)c(OC)cc23)ccc1N
InChI Key InChIKey=VKTFYWFVBORGFY-UHFFFAOYSA-N
Data  1 IC50
  Tab Delimited (TSV)   2D SDfile   Computed 3D by Vconf -m prep SDfile
Find this compound or compounds like it in BindingDB:
Activity Spreadsheet -- Enzyme Inhibition Constant Data from BindingDB
Found 1 hit for monomerid = 153650
TargetTyrosine-protein kinase receptor UFO(Homo sapiens (Human))
Lead Discovery Center
US Patent
LigandPNGBDBM153650(US8999982, 4-((6,7-dimethoxyquinolin-4- yl)oxy)-2-...)
Affinity DataIC50: >1.00E+4nMpH: 8.0Assay Description:The principle behind this assay is based upon the binding and displacement of an Alexa Fluor 647-labeled tracer to the kinase of interest. Binding of...
In DepthDetails US Patent