BDBM153723 2-(4-Fluorophenoxy)-N-(5-methyl-1H-pyrazol-3-yl)-6-(4-methylpiperazin-1-yl)pyrimidin-4-amine (15f)
SMILES CN1CCN(CC1)c1cc(Nc2cc(C)[nH]n2)nc(Oc2ccc(F)cc2)n1
InChI Key InChIKey=OBVJFUCJPICORB-UHFFFAOYSA-N
Data  1 IC50
  Tab Delimited (TSV)   2D SDfile   Computed 3D by Vconf -m prep SDfile
Find this compound or compounds like it in BindingDB:
Activity Spreadsheet -- Enzyme Inhibition Constant Data from BindingDB
Found 1 hit for monomerid = 153723
TargetSerine/threonine-protein kinase TBK1(Homo sapiens (Human))
Technical University Of Dortmund
LigandPNGBDBM153723(2-(4-Fluorophenoxy)-N-(5-methyl-1H-pyrazol-3-yl)-6...)
Affinity DataIC50:  840nM. Assay description: IC50 determinations for TBK1 were performed with the KinEASE-STK assay from Cisbio according to the manufacturer's instructions. A biotinylated s...
In DepthDetails ArticlePubMed