BDBM153792 US8999981, A37
SMILES C[C@H]1CN2CCC[C@H]2CN1C(=O)N1Cc2c(NC(=O)c3c(F)cccc3C(F)(F)F)n[nH]c2C1(C)C
InChI Key
Data  1 KI
  Tab Delimited (TSV)   2D SDfile   Computed 3D by Vconf -m prep SDfile
Find this compound or compounds like it in BindingDB:
Activity Spreadsheet -- Enzyme Inhibition Constant Data from BindingDB
Found 1 hit for monomerid = 153792
TargetProtein kinase C beta type(Homo sapiens (Human))
Pfizer
US Patent
LigandPNGBDBM153792(US8999981, A37)
Affinity DataKi:  155nM ΔG°:  -9.44kcal/molepH: 7.4 T: 2°C. Assay description: Protein Kinase C beta 2 (PKC beta II) catalyzes the production of ADP from ATP that accompanies the phosphoryl transfer to the PKC Pseudosubstrate pe...
In DepthDetails US Patent