BDBM153965 US8999981, F21
SMILES C[C@@H]1CN([C@@H](C)CN1CC1CCOCC1)C(=O)N1Cc2c(NC(=O)c3cc(C)no3)n[nH]c2C1(C)C
InChI Key
Data  1 KI
  Tab Delimited (TSV)   2D SDfile   Computed 3D by Vconf -m prep SDfile
Find this compound or compounds like it in BindingDB:
Activity Spreadsheet -- Enzyme Inhibition Constant Data from BindingDB
Found 1 hit for monomerid = 153965
TargetProtein kinase C beta type(Homo sapiens (Human))
Pfizer
US Patent
LigandPNGBDBM153965(US8999981, F21)
Affinity DataKi:  38.1nM ΔG°:  -10.3kcal/molepH: 7.4 T: 2°C. Assay description: Protein Kinase C beta 2 (PKC beta II) catalyzes the production of ADP from ATP that accompanies the phosphoryl transfer to the PKC Pseudosubstrate pe...
In DepthDetails US Patent