BDBM15399 3-(5-chloro-2,4-dihydroxyphenyl)-N-[(4-sulfamoylphenyl)methyl]-1H-pyrazole-4-carboxamide::3-(5-chloro-2,4-dihydroxyphenyl)-pyrazole-4-carboxamide 14o::CHEMBL200255
SMILES NS(=O)(=O)c1ccc(CNC(=O)c2c[nH]nc2-c2cc(Cl)c(O)cc2O)cc1
InChI Key InChIKey=OOHYJGNSESWEFT-UHFFFAOYSA-N
Data  2 IC50
PDB links: 1 PDB ID matches this monomer.
  Tab Delimited (TSV)   2D SDfile   Computed 3D by Vconf -m prep SDfile
Find this compound or compounds like it in BindingDB:
Activity Spreadsheet -- Enzyme Inhibition Constant Data from BindingDB
Found 2 hits for monomerid = 15399
TargetHeat shock protein HSP 90-beta(Homo sapiens (Human))
Memorial Sloan-Kettering Cancer Center
Curated by ChEMBL
LigandPNGBDBM15399(3-(5-chloro-2,4-dihydroxyphenyl)-N-[(4-sulfamoylph...)
Affinity DataIC50:  461nM. Assay description: Inhibition of Hsp90
TargetHeat shock protein HSP 90-beta(Homo sapiens (Human))
Memorial Sloan-Kettering Cancer Center
Curated by ChEMBL
LigandPNGBDBM15399(3-(5-chloro-2,4-dihydroxyphenyl)-N-[(4-sulfamoylph...)
Affinity DataIC50:  461nMpH: 7.4 T: 2°C. Assay description: The assay is based upon displacement of a fluorescently labeled molecule, which binds specifically to the ATP-binding site of full-length human Hsp90...