BDBM154152 US9012443, 160
SMILES COc1cc(Cl)ccc1-c1nccc2cc(ccc12)S(=O)(=O)Nc1ccncn1
InChI Key InChIKey=MADSSZAGIJQFOW-UHFFFAOYSA-N
Data  2 IC50
  Tab Delimited (TSV)   2D SDfile   Computed 3D by Vconf -m prep SDfile
Find this compound or compounds like it in BindingDB:
Activity Spreadsheet -- Enzyme Inhibition Constant Data from BindingDB
Found 2 hits for monomerid = 154152
TargetSodium channel protein type 9 subunit alpha(Homo sapiens (Human))
Amgen
US Patent
LigandPNGBDBM154152(US9012443, 160)
Affinity DataIC50:  1.33E+3nM. Assay description: 293 cells stably transfected with human Nav1.7 were recorded in whole cell voltage clamp mode with the PatchXpress automated electrophysiology system...
In DepthDetails US Patent
TargetSodium channel protein type 9 subunit alpha(Homo sapiens (Human))
Amgen
US Patent
LigandPNGBDBM154152(US9012443, 160)
Affinity DataIC50:  20nM. Assay description: 293 Cells stably transfected with either Nav 1.7 or Nav 1.5 were recorded in population patch-clamp mode with the IonWorks Quattro automated electrop...
In DepthDetails US Patent