BDBM154184 US9012443, 193
SMILES Clc1ccc(Oc2nccc3cc(ccc23)S(=O)(=O)Nc2ccncn2)cc1Cl
InChI Key InChIKey=SWJGXXRAIWHUPX-UHFFFAOYSA-N
Data  1 IC50
  Tab Delimited (TSV)   2D SDfile   Computed 3D by Vconf -m prep SDfile
Find this compound or compounds like it in BindingDB:
Activity Spreadsheet -- Enzyme Inhibition Constant Data from BindingDB
Found 1 hit for monomerid = 154184
TargetSodium channel protein type 9 subunit alpha(Homo sapiens (Human))
Amgen
US Patent
LigandPNGBDBM154184(US9012443, 193)
Affinity DataIC50:  4.98E+3nM. Assay description: 293 Cells stably transfected with either Nav 1.7 or Nav 1.5 were recorded in population patch-clamp mode with the IonWorks Quattro automated electrop...
Ligand InfoPC cidPC sid
In DepthDetails US Patent