BDBM154378 US9012443, 417
SMILES NC(=O)COc1cc(F)ccc1-c1nccc2cc(ccc12)S(=O)(=O)Nc1nccs1
InChI Key InChIKey=QPNFLHSRHQUABB-UHFFFAOYSA-N
Data  1 IC50
  Tab Delimited (TSV)   2D SDfile   Computed 3D by Vconf -m prep SDfile
Find this compound or compounds like it in BindingDB:
Activity Spreadsheet -- Enzyme Inhibition Constant Data from BindingDB
Found 1 hit for monomerid = 154378
TargetSodium channel protein type 9 subunit alpha(Homo sapiens (Human))
Amgen
US Patent
LigandPNGBDBM154378(US9012443, 417)
Affinity DataIC50:  1.23E+3nM. Assay description: 293 cells stably transfected with human Nav1.7 were recorded in whole cell voltage clamp mode with the PatchXpress automated electrophysiology system...
In DepthDetails US Patent