BDBM154527 2336 (17j)
SMILES COc1ccc(cc1)-c1sc2ccccc2c1-c1ccc(O)cc1
InChI Key InChIKey=BIFMXJBRWDNSAA-UHFFFAOYSA-N
Data  4 IC50
  Tab Delimited (TSV)   2D SDfile   Computed 3D by Vconf -m prep SDfile
Find this compound or compounds like it in BindingDB:
Activity Spreadsheet -- Enzyme Inhibition Constant Data from BindingDB
Found 4 hits for monomerid = 154527
TargetPhospholipase D1(Homo sapiens (Human))
Vanderbilt University
LigandPNGBDBM154527(2336 (17j))
Affinity DataIC50:  1.01E+4nMpH: 7.5Assay Description:Briefly, PLD activity was measured as the release of free [3H]-choline from [choline-methyl-3H] dipalmitoylphosphatidylcholine ([3H]-DPPC). 3−5...
In DepthDetails ArticlePubMed
TargetPhospholipase(Pseudomonas aeruginosa (g-Proteobacteria))
Vanderbilt University
LigandPNGBDBM154527(2336 (17j))
Affinity DataIC50: >2.00E+4nMpH: 7.5Assay Description:In a 96-black well plate, in a final reaction volume of 200 μL, the following components were combined on ice to yield final concentrations of 5...
In DepthDetails ArticlePubMed
TargetPhospholipase(Pseudomonas aeruginosa (g-Proteobacteria))
Vanderbilt University
LigandPNGBDBM154527(2336 (17j))
Affinity DataIC50: >3.00E+4nMpH: 7.5Assay Description:In brief, 6 nM purified PldA was incubated with liposomes containing 90 μM 1,2-dioleoyl-sn-glycero-3-phospho-(1′-rac-glycerol), 10 μM...
In DepthDetails ArticlePubMed
TargetPhospholipase D2(Homo sapiens (Human))
Vanderbilt University
LigandPNGBDBM154527(2336 (17j))
Affinity DataIC50:  3.20E+3nMpH: 7.5Assay Description:Briefly, PLD activity was measured as the release of free [3H]-choline from [choline-methyl-3H] dipalmitoylphosphatidylcholine ([3H]-DPPC). 3−5...
In DepthDetails ArticlePubMed