BDBM154736 US8999957, Table 3, Compound 8
SMILES O=C(NC1CCCCN(CCc2ccccc2)C1)c1ccc2[nH]nc(-c3ccncc3)c2c1
InChI Key
Data  1 IC50
  Tab Delimited (TSV)   2D SDfile   Computed 3D by Vconf -m prep SDfile
Find this compound or compounds like it in BindingDB:
Activity Spreadsheet -- Enzyme Inhibition Constant Data from BindingDB
Found 1 hit for monomerid = 154736
TargetMitogen-activated protein kinase 1(Mus musculus (Mouse))
Merck Sharp & Dohme
US Patent
LigandPNGBDBM154736(US8999957, Table 3, Compound 8)
Affinity DataIC50:  8.72nM. Assay description: Condition 1: Activated ERK2 activity was also determined in the IMAP assay format using the procedure outlined above. 1 μl of 25× compound was a...
In DepthDetails US Patent