BDBM15489 (+/-) racemate::(3R,4S)-4-(2-chloro-4-fluorophenyl)-1-[6-(thiophen-3-yl)pyrimidin-4-yl]pyrrolidin-3-amine::Pyrrolidine-constrained phenethylamine 25a
SMILES N[C@H]1CN(C[C@@H]1c1ccc(F)cc1Cl)c1cc(ncn1)-c1ccsc1
InChI Key InChIKey=NPRMBEFOHOIZLG-ZBFHGGJFSA-N
Data  1 KI
  Tab Delimited (TSV)   2D SDfile   Computed 3D by Vconf -m prep SDfile
Find this compound or compounds like it in BindingDB:
Activity Spreadsheet -- Enzyme Inhibition Constant Data from BindingDB
Found 1 hit for monomerid = 15489
TargetDipeptidyl peptidase 4(Homo sapiens (Human))
Abbott Laboratories
LigandPNGBDBM15489((+/-) racemate | (3R,4S)-4-(2-chloro-4-fluoropheny...)
Affinity DataKi:  34nM. Assay description: The DPP activity resulted in the formation of the fluorescent product amidomethylcoumarin (AMC), which was monitored by excitation at 355 nm and meas...
In DepthDetails ArticlePubMed