BDBM155027 US9000044, 46
SMILES Cc1c(CC(O)=O)cc2ccc(F)cc2c1-c1ccc(cc1)S(=O)(=O)N1CCCC1
InChI Key InChIKey=IVSKDFSTWCWYKU-UHFFFAOYSA-N
Data  1 IC50
  Tab Delimited (TSV)   2D SDfile   Computed 3D by Vconf -m prep SDfile
Find this compound or compounds like it in BindingDB:
Activity Spreadsheet -- Enzyme Inhibition Constant Data from BindingDB
Found 1 hit for monomerid = 155027
TargetProstaglandin D2 receptor 2(Homo sapiens (Human))
Hoffmann-La Roche
US Patent
LigandPNGBDBM155027(US9000044, 46)
Affinity DataIC50:  0.700nM. Assay description: Cell Culture Conditions: CHO-K1 cells previously transfected with G-alpha 16 were subsequently transfected with the human CRTH2 receptor and the neom...
In DepthDetails US Patent