BDBM155085 US9000153, 38
SMILES COc1cc2ncc3n(C)c(=O)n(-c4ccc(cc4F)C#N)c3c2cc1-c1ccnn1C
InChI Key InChIKey=FTMGCCSVRSFHTH-UHFFFAOYSA-N
Data  1 IC50
  Tab Delimited (TSV)   2D SDfile   Computed 3D by Vconf -m prep SDfile
Find this compound or compounds like it in BindingDB:
Activity Spreadsheet -- Enzyme Inhibition Constant Data from BindingDB
Found 1 hit for monomerid = 155085
TargetDNA-dependent protein kinase catalytic subunit(Homo sapiens (Human))
Merck Patent
US Patent
LigandPNGBDBM155085(US9000153, 38)
Affinity DataIC50:  0.300nMpH: 7.4 T: 2°C. Assay description: The kinase assay was carried out in streptavidin-coated 348-well microtitre FlashPlates®. To this end, 1.5 μg of the DNA-PK/protein complex and ...
In DepthDetails US Patent