BDBM155092 US9000182, 2, isomer 1
SMILES CC(C)COc1ccc2C[C@@]3(CC[C@H](O)CC3)[C@@]3(N=C(C)C(N)=N3)c2c1
InChI Key InChIKey=GWDMNQZCWCEASB-MAODMQOUSA-N
Data  1 IC50
  Tab Delimited (TSV)   2D SDfile   Computed 3D by Vconf -m prep SDfile
Find this compound or compounds like it in BindingDB:
Activity Spreadsheet -- Enzyme Inhibition Constant Data from BindingDB
Found 1 hit for monomerid = 155092
TargetBeta-secretase 1(Homo sapiens (Human))
Astrazeneca
US Patent
LigandPNGBDBM155092(US9000182, 2, isomer 1)
Affinity DataIC50:  13nMpH: 2.5Assay Description:The beta -secretase enzyme used in the TR-FRET is prepared as follows:The cDNA for the soluble part of the human (3-Secretase (AA 1-AA 460) was clone...
In DepthDetails US Patent